Target
Matrix metalloproteinase-16
Ligand
BDBM50183715
Substrate
Meas. Tech.
ChEMBL_497442 (CHEMBL1005436)
Ki
>5554±n/a nM
Citation
 Georgiadis, DYiotakis, A Specific targeting of metzincin family members with small-molecule inhibitors: progress toward a multifarious challenge. Bioorg Med Chem 16:8781-94 (2008)  
Target
Name:
Matrix metalloproteinase-16
Synonyms:
C8orf57 MMP-X2 MMP16_HUMAN MT-MMP 3 MT3MMP Matrix metalloproteinase 16 Membrane-type matrix metalloproteinase 3 | Membrane-type-3 matrix metalloproteinase
Type:
PROTEIN
Mol. Mass.:
69536.76
Organism:
Homo sapiens (Human)
Description:
ChEMBL_799129
Residue:
607
  
Inhibitor
Name:
BDBM50183715
Synonyms:
CHEMBL207305 N-(4-(2-(hydroxyamino)-2-oxoethyl)tetrahydro-2H-pyran-4-yl)-4-((2-methylquinolin-4-yl)methoxy)benzamide
Type:
Small organic molecule
Emp. Form.:
C25H27N3O5
Mol. Mass.:
449.499
SMILES:
Cc1cc(COc2ccc(cc2)C(=O)NC2(CC(=O)NO)CCOCC2)c2ccccc2n1
: