Target
ATP-dependent translocase ABCB1
Ligand
BDBM50275945
Substrate
Meas. Tech.
ChEMBL_493332 (CHEMBL952395)
Ki
770±n/a nM
Citation
 Jiménez-Alonso, SPérez-Lomas, ALEstévez-Braun, AMuñoz Martinez, FChávez Orellana, HRavelo, AGGamarro, FCastanys, SLópez, M Bis-pyranobenzoquinones as a new family of reversal agents of the multidrug resistance phenotype mediated by P-glycoprotein in mammalian cells and the protozoan parasite Leishmania. J Med Chem 51:7132-43 (2009)  
Target
Name:
ATP-dependent translocase ABCB1
Synonyms:
ABCB1 MDR1_HUMAN Multidrug resistance protein 1 P-glycoprotein (P-gp) PGY1
Type:
Protein
Mol. Mass.:
141503.50
Organism:
Homo sapiens (Human)
Description:
P08183
Residue:
1280
  
Inhibitor
Name:
BDBM50275945
Synonyms:
(1R,2R,4R,7bR,9R,11aR)-2,5,5,9,12,12-Hexamethyl-1,3,4,4a,5,8,9,10,11,11a,12,14b-dodecahydro-2H,7bH-benzo[c]isochromeno[3,4-g]chromene-7,14-dione | CHEMBL513403
Type:
Small organic molecule
Emp. Form.:
C26H36O4
Mol. Mass.:
412.5616
SMILES:
C[C@@H]1CC[C@@H]2[C@@H](C1)C1=C(OC2(C)C)C(=O)C2=C(OC(C)(C)[C@@H]3CC[C@@H](C)C[C@@H]23)C1=O
: