Target
ATP-dependent translocase ABCB1
Ligand
BDBM50275948
Substrate
Meas. Tech.
ChEMBL_493332 (CHEMBL952395)
Ki
510±n/a nM
Citation
 Jiménez-Alonso, SPérez-Lomas, ALEstévez-Braun, AMuñoz Martinez, FChávez Orellana, HRavelo, AGGamarro, FCastanys, SLópez, M Bis-pyranobenzoquinones as a new family of reversal agents of the multidrug resistance phenotype mediated by P-glycoprotein in mammalian cells and the protozoan parasite Leishmania. J Med Chem 51:7132-43 (2009)  
Target
Name:
ATP-dependent translocase ABCB1
Synonyms:
ABCB1 MDR1_HUMAN Multidrug resistance protein 1 P-glycoprotein (P-gp) PGY1
Type:
Protein
Mol. Mass.:
141503.50
Organism:
Homo sapiens (Human)
Description:
P08183
Residue:
1280
  
Inhibitor
Name:
BDBM50275948
Synonyms:
(4R,13S,19R,28R)-8,23-dimethoxy-14,14,29,29-tetramethyl-11,15,27,30-tetraoxaheptacyclo[16.12.0.0^{3,16}.0^{4,13}.0^{5,10}.0^{19,28}.0^{20,25}]triaconta-1(18),3(16),5(10),6,8,20(25),21,23-octaene-2,17-dione | CHEMBL450343
Type:
Small organic molecule
Emp. Form.:
C32H32O8
Mol. Mass.:
544.5917
SMILES:
COc1ccc2[C@H]3[C@@H](OCc2c1)C(C)(C)OC1=C3C(=O)C2=C([C@@H]3[C@@H](COc4cc(OC)ccc34)C(C)(C)O2)C1=O
: