Target
Potassium voltage-gated channel subfamily A member 5
Ligand
BDBM50000778
Substrate
Meas. Tech.
ChEMBL_559919 (CHEMBL1013713)
IC50
6100±n/a nM
Citation
 Vaccaro, WHuynh, TLloyd, JAtwal, KFinlay, HJLevesque, PConder, MLJenkins-West, TShi, HSun, L Dihydropyrazolopyrimidine inhibitors of K(V)1.5 (I(Kur)). Bioorg Med Chem Lett 18:6381-5 (2008)  
Target
Name:
Potassium voltage-gated channel subfamily A member 5
Synonyms:
HK2 KCNA5 Potassium voltage-gated channel subfamily A member 5 Voltage-gated potassium channel subunit Kv1.5
Type:
Enzyme
Mol. Mass.:
67222.47
Organism:
Homo sapiens (Human)
Description:
P22460
Residue:
613
  
Inhibitor
Name:
BDBM50000778
Synonyms:
(nifedipine) 2,6-Dimethyl-4-(2-nitro-phenyl)-1,4-dihydro-pyridine-3,5-dicarboxylic acid dimethyl ester 2,6-Dimethyl-4-(2-nitro-phenyl)-1,4-dihydro-pyridine-3,5-dicarboxylic acid dimethyl ester cid_4485 | nifedipine
Type:
Small organic molecule
Emp. Form.:
C17H18N2O6
Mol. Mass.:
346.3346
SMILES:
COC([O-])=C1C(C(C(=[OH+])OC)=C(C)N=C1C)c1ccccc1[N+]([O-])=O
: