Target
Adenosine receptor A1
Ligand
BDBM50279421
Substrate
Meas. Tech.
ChEMBL_545004 (CHEMBL1014639)
Ki
11200±n/a nM
Citation
 Bansal, RKumar, GGandhi, DYoung, LCHarvey, AL Synthesis of a series of 8-(substituted-phenyl)xanthines and a study on the effects of substitution pattern of phenyl substituents on affinity for adenosine A(1) and A(2A) receptors. Eur J Med Chem 44:2122-7 (2009)  
Target
Name:
Adenosine receptor A1
Synonyms:
A1 adenosine receptor (hA1) AA1R_HUMAN ADORA1 Adenosine A1-receptor Adenosine receptor A1 (hA1) | Adenosine transporter (AdT)
Type:
G Protein-Coupled Receptor (GPCR)
Mol. Mass.:
36520.92
Organism:
Homo sapiens (Human)
Description:
P30542
Residue:
326
  
Inhibitor
Name:
BDBM50279421
Synonyms:
1,3-Dimethyl-8-[3-methoxy-4-(2-pyrrolidin-4-ylethoxy)-phenyl]xanthine | CHEMBL486719
Type:
Small organic molecule
Emp. Form.:
C20H25N5O4
Mol. Mass.:
399.4436
SMILES:
COc1cc(ccc1OCCN1CCCC1)-c1nc2n(C)c(=O)n(C)c(=O)c2[nH]1
: