Target
Adenosine receptor A2a
Ligand
BDBM50279730
Substrate
Meas. Tech.
ChEMBL_545005 (CHEMBL1014640)
Ki
600±n/a nM
Citation
 Bansal, RKumar, GGandhi, DYoung, LCHarvey, AL Synthesis of a series of 8-(substituted-phenyl)xanthines and a study on the effects of substitution pattern of phenyl substituents on affinity for adenosine A(1) and A(2A) receptors. Eur J Med Chem 44:2122-7 (2009)  
Target
Name:
Adenosine receptor A2a
Synonyms:
A2A adenosine receptor (hA2A) ADENOSINE A2 ADORA2 Adenosine A2A receptor (A2AAR)
Type:
G Protein-Coupled Receptor (GPCR)
Mol. Mass.:
44716.46
Organism:
Homo sapiens (Human)
Description:
P29274
Residue:
412
  
Inhibitor
Name:
BDBM50279730
Synonyms:
8-[4-(2-Dimethylaminoethoxy)-3-methoxyphenyl]-1,3-dimethylxanthine | CHEMBL472684
Type:
Small organic molecule
Emp. Form.:
C18H23N5O4
Mol. Mass.:
373.4063
SMILES:
COc1cc(ccc1OCCN(C)C)-c1nc2n(C)c(=O)n(C)c(=O)c2[nH]1
: