Target
Leukotriene A-4 hydrolase
Ligand
BDBM50266243
Substrate
Meas. Tech.
ChEMBL_544515 (CHEMBL1013487)
IC50
4898±n/a nM
Citation
 Enomoto, HMorikawa, YMiyake, YTsuji, FMizuchi, MSuhara, HFujimura, KHoriuchi, MBan, M Synthesis and biological evaluation of N-mercaptoacylcysteine derivatives as leukotriene A4 hydrolase inhibitors. Bioorg Med Chem Lett 19:442-6 (2008)  
Target
Name:
Leukotriene A-4 hydrolase
Synonyms:
LKHA4_CAVPO | LTA4H
Type:
PROTEIN
Mol. Mass.:
68972.78
Organism:
Cavia porcellus
Description:
ChEMBL_544515
Residue:
611
  
Inhibitor
Name:
BDBM50266243
Synonyms:
(R)-2-((S)-3-mercapto-2-methylpropanamido)-3-(4-nitrobenzylthio)propanoic acid | CHEMBL456278
Type:
Small organic molecule
Emp. Form.:
C14H18N2O5S2
Mol. Mass.:
358.433
SMILES:
C[C@H](CS)C(=O)N[C@@H](CSCc1ccc(cc1)[N+]([O-])=O)C(O)=O
: