Target
Leukotriene A-4 hydrolase
Ligand
BDBM50266107
Substrate
Meas. Tech.
ChEMBL_544515 (CHEMBL1013487)
IC50
>10000±n/a nM
Citation
 Enomoto, HMorikawa, YMiyake, YTsuji, FMizuchi, MSuhara, HFujimura, KHoriuchi, MBan, M Synthesis and biological evaluation of N-mercaptoacylcysteine derivatives as leukotriene A4 hydrolase inhibitors. Bioorg Med Chem Lett 19:442-6 (2008)  
Target
Name:
Leukotriene A-4 hydrolase
Synonyms:
LKHA4_CAVPO | LTA4H
Type:
PROTEIN
Mol. Mass.:
68972.78
Organism:
Cavia porcellus
Description:
ChEMBL_544515
Residue:
611
  
Inhibitor
Name:
BDBM50266107
Synonyms:
(R)-3-(4-(dimethylamino)benzylthio)-2-(3-mercaptopropanamido)propanoic acid | CHEMBL456470
Type:
Small organic molecule
Emp. Form.:
C15H22N2O3S2
Mol. Mass.:
342.477
SMILES:
CN(C)c1ccc(CSC[C@H](NC(=O)CCS)C(O)=O)cc1
: