Target
Leukotriene A-4 hydrolase
Ligand
BDBM50266248
Substrate
Meas. Tech.
ChEMBL_544515 (CHEMBL1013487)
IC50
67±n/a nM
Citation
 Enomoto, HMorikawa, YMiyake, YTsuji, FMizuchi, MSuhara, HFujimura, KHoriuchi, MBan, M Synthesis and biological evaluation of N-mercaptoacylcysteine derivatives as leukotriene A4 hydrolase inhibitors. Bioorg Med Chem Lett 19:442-6 (2008)  
Target
Name:
Leukotriene A-4 hydrolase
Synonyms:
LKHA4_CAVPO | LTA4H
Type:
PROTEIN
Mol. Mass.:
68972.78
Organism:
Cavia porcellus
Description:
ChEMBL_544515
Residue:
611
  
Inhibitor
Name:
BDBM50266248
Synonyms:
(2R)-3-(1-(4-isopropylphenyl)propylthio)-2-((S)-3-mercapto-2-methylpropanamido)propanoic acid | CHEMBL458447
Type:
Small organic molecule
Emp. Form.:
C19H29NO3S2
Mol. Mass.:
383.568
SMILES:
CCC(SC[C@H](NC(=O)[C@H](C)CS)C(O)=O)c1ccc(cc1)C(C)C
: