Target
Cytochrome P450 2C9
Ligand
BDBM50273446
Substrate
Meas. Tech.
ChEMBL_561228 (CHEMBL1012774)
Ki
3470±n/a nM
Citation
 Peng, CCCape, JLRushmore, TCrouch, GJJones, JP Cytochrome P450 2C9 type II binding studies on quinoline-4-carboxamide analogues. J Med Chem 51:8000-11 (2008)  
Target
Name:
Cytochrome P450 2C9
Synonyms:
(R)-limonene 6-monooxygenase CP2C9_HUMAN CYP2C9 Cytochrome P450 2C9 (CYP2C9 ) P-450MP P450 PB-1 | S-mephenytoin 4-hydroxylase
Type:
Enzyme
Mol. Mass.:
55636.33
Organism:
Homo sapiens (Human)
Description:
P11712
Residue:
490
  
Inhibitor
Name:
BDBM50273446
Synonyms:
CHEMBL513115 | N-Phenyl-2-(pyridin-2-yl)quinoline-4-carboxamide
Type:
Small organic molecule
Emp. Form.:
C21H15N3O
Mol. Mass.:
325.3633
SMILES:
O=C(Nc1ccccc1)c1cc(nc2ccccc12)-c1ccccn1
: