Target
Endothelial lipase
Ligand
BDBM50254343
Substrate
Meas. Tech.
ChEMBL_559992 (CHEMBL1018742)
IC50
60±n/a nM
Citation
 Goodman, KBBury, MJCheung, MCichy-Knight, MADowdell, SEDunn, AKLee, DLieby, JAMoore, MLScherzer, DASha, DSuarez, DPMurphy, DJHarpel, MRManas, ESMcNulty, DEAnnan, RSMatico, RESchwartz, BKTrill, JJSweitzer, TDWang, DYKeller, PMKrawiec, JAJaye, MC Discovery of potent, selective sulfonylfuran urea endothelial lipase inhibitors. Bioorg Med Chem Lett 19:27-30 (2008)  
Target
Name:
Endothelial lipase
Synonyms:
EDL Endothelial cell-derived lipase LIPG
Type:
Protein
Mol. Mass.:
56805.62
Organism:
Homo sapiens (Human)
Description:
Q9Y5X9
Residue:
500
  
Inhibitor
Name:
BDBM50254343
Synonyms:
(S)-1-(2-methyl-5-(piperidin-1-ylsulfonyl)furan-3-yl)-3-(1-phenylethyl)urea | CHEMBL467023
Type:
Small organic molecule
Emp. Form.:
C19H25N3O4S
Mol. Mass.:
391.484
SMILES:
C[C@H](NC(=O)Nc1cc(oc1C)S(=O)(=O)N1CCCCC1)c1ccccc1
: