Target
Lipoprotein lipase
Ligand
BDBM50254341
Substrate
Meas. Tech.
ChEMBL_559993 (CHEMBL1018743)
IC50
320±n/a nM
Citation
 Goodman, KBBury, MJCheung, MCichy-Knight, MADowdell, SEDunn, AKLee, DLieby, JAMoore, MLScherzer, DASha, DSuarez, DPMurphy, DJHarpel, MRManas, ESMcNulty, DEAnnan, RSMatico, RESchwartz, BKTrill, JJSweitzer, TDWang, DYKeller, PMKrawiec, JAJaye, MC Discovery of potent, selective sulfonylfuran urea endothelial lipase inhibitors. Bioorg Med Chem Lett 19:27-30 (2008)  
Target
Name:
Lipoprotein lipase
Synonyms:
LIPL_RAT | Lpl
Type:
PROTEIN
Mol. Mass.:
53093.31
Organism:
Rattus norvegicus
Description:
ChEMBL_559993
Residue:
474
  
Inhibitor
Name:
BDBM50254341
Synonyms:
1-(2-chlorophenyl)-3-(2-methyl-5-(piperidin-1-ylsulfonyl)furan-3-yl)urea | CHEMBL451911
Type:
Small organic molecule
Emp. Form.:
C17H20ClN3O4S
Mol. Mass.:
397.876
SMILES:
Cc1oc(cc1NC(=O)Nc1ccccc1Cl)S(=O)(=O)N1CCCCC1
: