Target
Macrophage migration inhibitory factor
Ligand
BDBM50265523
Substrate
Meas. Tech.
ChEMBL_558850 (CHEMBL1021636)
IC50
500±n/a nM
Citation
 Cournia, ZLeng, LGandavadi, SDu, XBucala, RJorgensen, WL Discovery of human macrophage migration inhibitory factor (MIF)-CD74 antagonists via virtual screening. J Med Chem 52:416-24 (2009)  
Target
Name:
Macrophage migration inhibitory factor
Synonyms:
GIF Glycosylation-inhibiting factor L-dopachrome tautomerase MIF/CD74 (Macrophage migration inhibitory factor and HLA-DR antigens-associated invariant chain) MMIF Macrophage migration inhibitory factor (MIF) | Phenylpyruvate tautomerase
Type:
Enzyme
Mol. Mass.:
12478.18
Organism:
Homo sapiens (Human)
Description:
P14174
Residue:
115
  
Inhibitor
Name:
BDBM50265523
Synonyms:
3-benzyl-5-methylbenzo[d]oxazol-2(3H)-one | CHEMBL523238
Type:
Small organic molecule
Emp. Form.:
C15H13NO2
Mol. Mass.:
239.2692
SMILES:
Cc1ccc2oc(=O)n(Cc3ccccc3)c2c1
: