Target
Equilibrative nucleoside transporter 1
Ligand
BDBM23617
Substrate
Meas. Tech.
ChEMBL_518728 (CHEMBL957103)
Ki
0.7±n/a nM
Citation
 Gupte, ABuolamwini, JK Synthesis and biological evaluation of phloridzin analogs as human concentrative nucleoside transporter 3 (hCNT3) inhibitors. Bioorg Med Chem Lett 19:917-21 (2009)  
Target
Name:
Equilibrative nucleoside transporter 1
Synonyms:
ENT1 Equilibrative Nucleoside Transporter 1 (ENT1) Equilibrative nucleoside transporter 1 S29A1_HUMAN Solute carrier family 29 member 1
Type:
Multi-pass membrane protein
Mol. Mass.:
50225.92
Organism:
Homo sapiens (Human)
Description:
Residue:
456
  
Inhibitor
Name:
BDBM23617
Synonyms:
(2R,3S,4R,5R)-2-(hydroxymethyl)-5-(6-{[(4-nitrophenyl)methyl]sulfanyl}-9H-purin-9-yl)oxolane-3,4-diol CHEMBL418509 NBTI | Nitrobenzylthioinosine
Type:
Small organic molecule
Emp. Form.:
C17H17N5O6S
Mol. Mass.:
419.412
SMILES:
OC[C@H]1O[C@H]([C@H](O)[C@@H]1O)n1cnc2c(SCc3ccc(cc3)[N+]([O-])=O)ncnc12
: