Target
Histone deacetylase 6
Ligand
BDBM50255852
Substrate
Meas. Tech.
ChEMBL_515267 (CHEMBL991291)
IC50
10±n/a nM
Citation
 Smil, DVManku, SChantigny, YALeit, SWahhab, AYan, TPFournel, MMaroun, CLi, ZLemieux, AMNicolescu, ARahil, JLefebvre, SPanetta, ABesterman, JMDéziel, R Novel HDAC6 isoform selective chiral small molecule histone deacetylase inhibitors. Bioorg Med Chem Lett 19:688-92 (2009)  
Target
Name:
Histone deacetylase 6
Synonyms:
Cereblon/Histone deacetylase 6 HDAC6 Histone deacetylase 6 (HDAC6) KIAA0901 | ORF Names:JM21
Type:
Chromatin regulator; hydrolase; repressor
Mol. Mass.:
131381.51
Organism:
Homo sapiens (Human)
Description:
Q9UBN7
Residue:
1215
  
Inhibitor
Name:
BDBM50255852
Synonyms:
4-(((R)-3-(4-hydroxybenzyl)-2,3-dihydro-2-oxoquinoxalin-4(1H)-yl)methyl)-N-hydroxybenzamide | CHEMBL481538
Type:
Small organic molecule
Emp. Form.:
C23H21N3O4
Mol. Mass.:
403.4305
SMILES:
ONC(=O)c1ccc(CN2[C@H](Cc3ccc(O)cc3)C(=O)Nc3ccccc23)cc1
: