Target
Beta-secretase 1
Ligand
BDBM50276538
Substrate
Meas. Tech.
ChEMBL_540840 (CHEMBL1036722)
IC50
1504±n/a nM
Citation
 Zhu, YXiao, KMa, LXiong, BFu, YYu, HWang, WWang, XHu, DPeng, HLi, JGong, QChai, QTang, XZhang, HLi, JShen, J Design, synthesis and biological evaluation of novel dual inhibitors of acetylcholinesterase and beta-secretase. Bioorg Med Chem 17:1600-13 (2009)  
Target
Name:
Beta-secretase 1
Synonyms:
ASP2 Aspartyl protease 2 BACE1 Beta-secretase (BACE) Beta-secretase 1 (BACE 1) Beta-secretase 1 (BACE1) Beta-site amyloid precursor protein cleaving enzyme 1 Memapsin-2 beta-Secretase (BACE-1) | beta-Secretase (BACE1)
Type:
Protein
Mol. Mass.:
55755.10
Organism:
Homo sapiens (Human)
Description:
P56817
Residue:
501
  
Inhibitor
Name:
BDBM50276538
Synonyms:
CHEMBL502753 | N-[(4S,5S,7R)-7-(1-Benzylpiperidin-4-yl)carbamoyl-5-hydroxy-2-methyloct-4-yl]-N'-[(R)-1-(4-fluorophenyl)ethyl]-5-[methyl(methylsulfonyl)amino]isophthalamide
Type:
Small organic molecule
Emp. Form.:
C40H54FN5O6S
Mol. Mass.:
751.95
SMILES:
CC(C)C[C@H](NC(=O)c1cc(cc(c1)C(=O)N[C@H](C)c1ccc(F)cc1)N(C)S(C)(=O)=O)[C@@H](O)C[C@@H](C)C(=O)NC1CCN(Cc2ccccc2)CC1
: