Target
Histone deacetylase 6
Ligand
BDBM50256995
Substrate
Meas. Tech.
ChEMBL_562514 (CHEMBL1014506)
IC50
450±n/a nM
Citation
 Manku, SAllan, MNguyen, NAjamian, ARodrigue, JTherrien, EWang, JGuo, TRahil, JPetschner, AJNicolescu, ALefebvre, SLi, ZFournel, MBesterman, JMDéziel, RWahhab, A Synthesis and evaluation of lysine derived sulfamides as histone deacetylase inhibitors. Bioorg Med Chem Lett 19:1866-70 (2009)  
Target
Name:
Histone deacetylase 6
Synonyms:
Cereblon/Histone deacetylase 6 HDAC6 Histone deacetylase 6 (HDAC6) KIAA0901 | ORF Names:JM21
Type:
Chromatin regulator; hydrolase; repressor
Mol. Mass.:
131381.51
Organism:
Homo sapiens (Human)
Description:
Q9UBN7
Residue:
1215
  
Inhibitor
Name:
BDBM50256995
Synonyms:
(S)-benzyl 1-(4,5-diphenylthiazol-2-ylamino)-1-oxo-6-(sulfamoylamino)hexan-2-ylcarbamate | CHEMBL475043
Type:
Small organic molecule
Emp. Form.:
C29H31N5O5S2
Mol. Mass.:
593.717
SMILES:
NS(=O)(=O)NCCCC[C@H](NC(=O)OCc1ccccc1)C(=O)Nc1nc(c(s1)-c1ccccc1)-c1ccccc1
: