Target
5-hydroxytryptamine receptor 2B
Ligand
BDBM50256782
Substrate
Meas. Tech.
ChEMBL_566858 (CHEMBL957592)
EC50
4.9±n/a nM
Citation
 Cho, SJJensen, NHKurome, TKadari, SManzano, MLMalberg, JECaldarone, BRoth, BLKozikowski, AP Selective 5-hydroxytryptamine 2C receptor agonists derived from the lead compound tranylcypromine: identification of drugs with antidepressant-like action. J Med Chem 52:1885-902 (2009)  
Target
Name:
5-hydroxytryptamine receptor 2B
Synonyms:
5-HT-2B 5-hydroxytryptamine (serotonin) receptor 2B [Homo sapiens] 5-hydroxytryptamine receptor 2C (5HT2C) HTR2B Serotonin 2b (5-HT2b) receptor | Serotonin Receptor 2B
Type:
G Protein-Coupled Receptor (GPCR)
Mol. Mass.:
54312.47
Organism:
Homo sapiens (Human)
Description:
Receptor binding assays were performed using human clone stably expressed in CHO cells.
Residue:
481
  
Inhibitor
Name:
BDBM50256782
Synonyms:
CHEMBL474633 | trans-[2-(4-Fluoro-3-methylphenyl)cyclopropyl]methylamine Hydrochloride
Type:
Small organic molecule
Emp. Form.:
C11H14FN
Mol. Mass.:
179.234
SMILES:
Cc1cc(ccc1F)[C@H]1C[C@@H]1CN
: