Target
Free fatty acid receptor 1
Ligand
BDBM50277777
Substrate
Meas. Tech.
ChEMBL_501421 (CHEMBL994680)
IC50
29±n/a nM
Citation
 Humphries, PSBenbow, JWBonin, PDBoyer, DDoran, SDFrisbie, RKPiotrowski, DWBalan, GBechle, BMConn, ELDirico, KJOliver, RMSoeller, WCSouthers, JAYang, X Synthesis and SAR of 1,2,3,4-tetrahydroisoquinolin-1-ones as novel G-protein-coupled receptor 40 (GPR40) antagonists. Bioorg Med Chem Lett 19:2400-3 (2009)  
Target
Name:
Free fatty acid receptor 1
Synonyms:
FFAR1 G-protein Coupled Receptor 40 | GPR40
Type:
G Protein-Coupled Receptor (GPCR)
Mol. Mass.:
31473.32
Organism:
Homo sapiens (Human)
Description:
O14842
Residue:
300
  
Inhibitor
Name:
BDBM50277777
Synonyms:
(3R,4R)-1-oxo-2-propyl-3-(4-(5-(trifluoromethyl)pyridin-2-yloxy)phenyl)-1,2,3,4-tetrahydroisoquinoline-4-carboxylic acid | CHEMBL519358
Type:
Small organic molecule
Emp. Form.:
C25H21F3N2O4
Mol. Mass.:
470.4404
SMILES:
CCCN1[C@H]([C@H](C(O)=O)c2ccccc2C1=O)c1ccc(Oc2ccc(cn2)C(F)(F)F)cc1
: