Target
DNA topoisomerase 1
Ligand
BDBM50249685
Substrate
Meas. Tech.
ChEMBL_498349 (CHEMBL1020204)
EC50
34±n/a nM
Citation
 Sunami, SNishimura, TNishimura, IIto, SArakawa, HOhkubo, M Synthesis and biological activities of topoisomerase I inhibitors, 6-arylmethylamino analogues of edotecarin. J Med Chem 52:3225-37 (2009)  
Target
Name:
DNA topoisomerase 1
Synonyms:
DNA topoisomerase I TOP1 | TOP1_HUMAN
Type:
Enzyme
Mol. Mass.:
90771.02
Organism:
Homo sapiens (Human)
Description:
P11387
Residue:
765
  
Inhibitor
Name:
BDBM50249685
Synonyms:
2,10-Dihydroxy-6-{[4-(hydroxymethyl)benzyl]amino}-13-(beta-D-glucopyranosyl)-12,13-dihydro-5H-indolo[2,3-a]pyrrolo[3,4-c]carbazole-5,7(6H)-dione | CHEMBL117315
Type:
Small organic molecule
Emp. Form.:
C34H30N4O11
Mol. Mass.:
670.6222
SMILES:
OC[C@H]1O[C@@H](On2c3cc(O)ccc3c3c4C(=O)N(NCc5ccc(CO)cc5)C(=O)c4c4c5ccc(O)cc5[nH]c4c23)[C@H](O)[C@@H](O)[C@@H]1O
: