Target
Alpha-1A adrenergic receptor
Ligand
BDBM50258642
Substrate
Meas. Tech.
ChEMBL_500044 (CHEMBL970447)
EC50
3±n/a nM
Citation
 Roberts, LRFish, PVIan Storer, RWhitlock, GA 6,7-Dihydro-5H-pyrrolo[1,2-a] imidazoles as potent and selective alpha1A adrenoceptor partial agonists. Bioorg Med Chem Lett 19:3113-7 (2009)  
Target
Name:
Alpha-1A adrenergic receptor
Synonyms:
ADA1A_HUMAN ADRA1C Alpha 1A-adrenoceptor Alpha adrenergic receptor 1a Alpha-adrenergic receptor 1c adrenergic Alpha1 | adrenergic Alpha1C
Type:
Cell-surface receptors
Mol. Mass.:
51511.67
Organism:
Homo sapiens (Human)
Description:
P35348
Residue:
466
  
Inhibitor
Name:
BDBM50258642
Synonyms:
6-(5-fluoro-2-(1H-pyrazol-5-yl)phenyl)-6,7-dihydro-5H-pyrrolo[1,2-a]imidazole | CHEMBL509350
Type:
Small organic molecule
Emp. Form.:
C15H13FN4
Mol. Mass.:
268.2889
SMILES:
Fc1ccc(-c2cc[nH]n2)c(c1)C1Cc2nccn2C1
: