Target
Squalene synthase
Ligand
BDBM50268509
Substrate
Meas. Tech.
ChEMBL_523734 (CHEMBL1007541)
Ki
740±n/a nM
Citation
 Song, YLiu, CILin, FYNo, JHHensler, MLiu, YLJeng, WYLow, JLiu, GYNizet, VWang, AHOldfield, E Inhibition of staphyloxanthin virulence factor biosynthesis in Staphylococcus aureus: in vitro, in vivo, and crystallographic results. J Med Chem 52:3869-80 (2009)  
Target
Name:
Squalene synthase
Synonyms:
FDFT1 FPP:FPP farnesyltransferase SQS Squalene synthetase
Type:
PROTEIN
Mol. Mass.:
48114.76
Organism:
Homo sapiens (Human)
Description:
ChEMBL_1352847
Residue:
417
  
Inhibitor
Name:
BDBM50268509
Synonyms:
CHEMBL495623 | N-[3-(3-(3,4-Dichlorophenoxy)phenyl)propyl]phosphonoacetamide Dipotassium Salt
Type:
Small organic molecule
Emp. Form.:
C17H16Cl2NO5P
Mol. Mass.:
416.193
SMILES:
[O-]P([O-])(=O)CC(=O)NCCCc1cccc(Oc2ccc(Cl)c(Cl)c2)c1
: