Target
Squalene synthase
Ligand
BDBM50268564
Substrate
Meas. Tech.
ChEMBL_523734 (CHEMBL1007541)
Ki
>30000±n/a nM
Citation
 Song, YLiu, CILin, FYNo, JHHensler, MLiu, YLJeng, WYLow, JLiu, GYNizet, VWang, AHOldfield, E Inhibition of staphyloxanthin virulence factor biosynthesis in Staphylococcus aureus: in vitro, in vivo, and crystallographic results. J Med Chem 52:3869-80 (2009)  
Target
Name:
Squalene synthase
Synonyms:
FDFT1 FPP:FPP farnesyltransferase SQS Squalene synthetase
Type:
PROTEIN
Mol. Mass.:
48114.76
Organism:
Homo sapiens (Human)
Description:
ChEMBL_1352847
Residue:
417
  
Inhibitor
Name:
BDBM50268564
Synonyms:
CHEMBL497815 | N-[3-(4-Biphenyl)propyl]phosphonoacetamide
Type:
Small organic molecule
Emp. Form.:
C17H20NO4P
Mol. Mass.:
333.3188
SMILES:
OP(O)(=O)CC(=O)NCCCc1ccc(cc1)-c1ccccc1
: