Target
Squalene synthase
Ligand
BDBM50268625
Substrate
Meas. Tech.
ChEMBL_523734 (CHEMBL1007541)
Ki
520±n/a nM
Citation
 Song, YLiu, CILin, FYNo, JHHensler, MLiu, YLJeng, WYLow, JLiu, GYNizet, VWang, AHOldfield, E Inhibition of staphyloxanthin virulence factor biosynthesis in Staphylococcus aureus: in vitro, in vivo, and crystallographic results. J Med Chem 52:3869-80 (2009)  
Target
Name:
Squalene synthase
Synonyms:
FDFT1 FPP:FPP farnesyltransferase SQS Squalene synthetase
Type:
PROTEIN
Mol. Mass.:
48114.76
Organism:
Homo sapiens (Human)
Description:
ChEMBL_1352847
Residue:
417
  
Inhibitor
Name:
BDBM50268625
Synonyms:
CHEMBL447414 | N-[3-(3-Phenoxyphenyl)propyl]phosphonodimethylacetamide DipotassiumSalt
Type:
Small organic molecule
Emp. Form.:
C19H22NO5P
Mol. Mass.:
375.3565
SMILES:
CC(C)(C(=O)NCCCc1cccc(Oc2ccccc2)c1)P([O-])([O-])=O
: