Target
4,4'-diapophytoene synthase
Ligand
BDBM50268678
Substrate
Meas. Tech.
ChEMBL_523732 (CHEMBL1007539)
Ki
>7000±n/a nM
Citation
 Song, YLiu, CILin, FYNo, JHHensler, MLiu, YLJeng, WYLow, JLiu, GYNizet, VWang, AHOldfield, E Inhibition of staphyloxanthin virulence factor biosynthesis in Staphylococcus aureus: in vitro, in vivo, and crystallographic results. J Med Chem 52:3869-80 (2009)  
Target
Name:
4,4'-diapophytoene synthase
Synonyms:
CRTM_STAAU crtM
Type:
PROTEIN
Mol. Mass.:
34309.10
Organism:
Staphylococcus aureus
Description:
ChEMBL_1352846
Residue:
287
  
Inhibitor
Name:
BDBM50268678
Synonyms:
CHEMBL525377 | N-Hydroxy-N-[3-(4-methylbiphenyl)propyl]phosphonoacetamide
Type:
Small organic molecule
Emp. Form.:
C18H22NO5P
Mol. Mass.:
363.3447
SMILES:
Cc1ccc(cc1)-c1ccc(CCCN(O)C(=O)CP(O)(O)=O)cc1
: