Target
Gamma-aminobutyric acid receptor subunit alpha-5
Ligand
BDBM26266
Substrate
Meas. Tech.
ChEMBL_519949 (CHEMBL954628)
Ki
35±n/a nM
Citation
 Taliani, SCosimelli, BDa Settimo, FMarini, AMLa Motta, CSimorini, FSalerno, SNovellino, EGreco, GCosconati, SMarinelli, LSalvetti, FL'Abbate, GTrasciatti, SMontali, MCosta, BMartini, C Identification of anxiolytic/nonsedative agents among indol-3-ylglyoxylamides acting as functionally selective agonists at the gamma-aminobutyric acid-A (GABAA) alpha2 benzodiazepine receptor. J Med Chem 52:3723-34 (2009)  
Target
Name:
Gamma-aminobutyric acid receptor subunit alpha-5
Synonyms:
GABA A Alpha5Beta2Gamma2 GABA A Alpha5m10Beta2Gamma2 GABA A Alpha5m9Beta2Gamma2 GABA A receptor alpha-5/beta-3/gamma-2 GBRA5_RAT Gabra5 | Gamma-aminobutyric acid receptor subunit alpha-5
Type:
Enzyme Catalytic Domain
Mol. Mass.:
52350.79
Organism:
RAT
Description:
GABA A alpha5 0 RAT::P19969
Residue:
464
  
Inhibitor
Name:
BDBM26266
Synonyms:
Ambien Dalparan ZPM Zolpidem tartrate
Type:
Small organic molecule
Emp. Form.:
C19H21N3O
Mol. Mass.:
307.3895
SMILES:
CN(C)C(=O)Cc1c(nc2ccc(C)cn12)-c1ccc(C)cc1
: