Target
Polyunsaturated fatty acid 5-lipoxygenase
Ligand
BDBM50000540
Substrate
Meas. Tech.
ChEBML_4165
IC50
2000±n/a nM
Citation
 Brooks, DWAlbert, DHDyer, RDBouska, JBYoung, PRotert, GMachinist, JMCarter, GW 1-Phenyl-[2H]-tetrahydropyridazin-3-one, A-53612, a selective orally active 5-lipoxygenase inhibitor Bioorg Med Chem Lett 2:1353-1356 (1992)    Article 
Target
Name:
Polyunsaturated fatty acid 5-lipoxygenase
Synonyms:
Alox5 LOX5_RAT
Type:
PROTEIN
Mol. Mass.:
78082.31
Organism:
Rattus norvegicus
Description:
ChEMBL_1432947
Residue:
673
  
Inhibitor
Name:
BDBM50000540
Synonyms:
1-(3-Trifluoromethyl-phenyl)-4,5-dihydro-1H-pyrazol-3-ylamine 1-(3-Trifluoromethyl-phenyl)-4,5-dihydro-1H-pyrazol-3-ylamine(BW 755 C) 1-(3-trifluoromethylphenyl)-4,5-dihydro-1H-3-pyrazolamine CHEMBL274642
Type:
Small organic molecule
Emp. Form.:
C10H10F3N3
Mol. Mass.:
229.2017
SMILES:
NC1=NN(CC1)c1cccc(c1)C(F)(F)F
: