Target
Polyunsaturated fatty acid lipoxygenase ALOX15
Ligand
BDBM50009004
Substrate
Meas. Tech.
ChEBML_30
IC50
420±n/a nM
Citation
 Brooks, DWAlbert, DHDyer, RDBouska, JBYoung, PRotert, GMachinist, JMCarter, GW 1-Phenyl-[2H]-tetrahydropyridazin-3-one, A-53612, a selective orally active 5-lipoxygenase inhibitor Bioorg Med Chem Lett 2:1353-1356 (1992)    Article 
Target
Name:
Polyunsaturated fatty acid lipoxygenase ALOX15
Synonyms:
15-Lipoxygenase-1 (15-LOX-1) Arachidonate 15-lipoxygenase LOG15 Reticulocyte 15-lipoxygenase-1 | Sphingosine 1-phosphate receptor 1 (S1P1)
Type:
Protein
Mol. Mass.:
74804.05
Organism:
Homo sapiens (Human)
Description:
Residue:
662
  
Inhibitor
Name:
BDBM50009004
Synonyms:
(phenidone)1-Phenyl-pyrazolidin-3-one 1-Phenyl-pyrazolidin-3-one (Phenidone) 1-phenylpyrazolidin-3-one PHENIDONE
Type:
Small organic molecule
Emp. Form.:
C9H10N2O
Mol. Mass.:
162.1885
SMILES:
O=C1CCN(N1)c1ccccc1
: