Target
Leukotriene B4 receptor 1
Ligand
BDBM50280291
Substrate
Meas. Tech.
ChEMBL_99654 (CHEMBL709312)
IC50
4.2±n/a nM
Citation
 Sofia, MJSaussyJr., DLJackson, WTMarder, PSilbaugh, SAFroelich, LLCockerham, SLStengel, PW Ortho-alkoxyphenol leukotriene B4 receptor antagonists: effect of a chroman carboxylic acid. Bioorg Med Chem Lett 2:1675-1680 (1992)    Article 
Target
Name:
Leukotriene B4 receptor 1
Synonyms:
BLT BLTR Chemoattractant receptor-like 1 GPR16 LTB4-R 1 Leukotriene B4 R1 Leukotriene B4 receptor 1 P2Y purinoceptor 7 | P2Y7
Type:
Enzyme Catalytic Domain
Mol. Mass.:
37582.68
Organism:
Homo sapiens (Human)
Description:
Q15722
Residue:
352
  
Inhibitor
Name:
BDBM50280291
Synonyms:
7-[3-(4-Ethoxy-2-ethyl-5-hydroxy-phenoxy)-propoxy]-8-propyl-chroman-2-carboxylic acid | CHEMBL416277
Type:
Small organic molecule
Emp. Form.:
C26H34O7
Mol. Mass.:
458.544
SMILES:
CCCc1c(OCCCOc2cc(O)c(OCC)cc2CC)ccc2CCC(Oc12)C(O)=O
: