Target
D(1A) dopamine receptor
Ligand
BDBM82247
Substrate
Meas. Tech.
ChEBML_58794
Ki
0.300000±n/a nM
Citation
 Chang, WKPeters, MFevig, VPKozlowski, JAZhou, GLowe, DBGuzik, HMcQuade, RDDuffy, RCoffin, VLBerger, JG Dopamine receptor binding properties of some 2,3,4,5-tetrahydro-1H-3-benzazepine-7-ols with non-aromatic substituents in the 5-position Bioorg Med Chem Lett 2:399-402 (1992)    Article 
Target
Name:
D(1A) dopamine receptor
Synonyms:
DOPAMINE D1 Dopamine D1 high Dopamine receptor Dopamine1-like Drd1a
Type:
Enzyme Catalytic Domain
Mol. Mass.:
49429.75
Organism:
RAT
Description:
P18901
Residue:
446
  
Inhibitor
Name:
BDBM82247
Synonyms:
8-Chloro-3-methyl-5-phenyl-2,3,4,5-tetrahydro-1H-benzo[d]azepin-7-ol(SCH 23390) CHEMBL2158641 SCH 23388 SCH 23390 (R-enantiomer) | SCH 23390,R(+)
Type:
Small organic molecule
Emp. Form.:
C17H18ClNO
Mol. Mass.:
287.784
SMILES:
CN1CCc2cc(Cl)c(O)cc2[C@H](C1)c1ccccc1
: