Target
3-hydroxy-3-methylglutaryl-coenzyme A reductase
Ligand
BDBM50014345
Substrate
Meas. Tech.
ChEBML_80646
IC50
3200±n/a nM
Citation
 Sit, SYParker, RAWright, JJ Synthesis of tetrazol-1-yl analogs of HMG-COA reductase inhibitor BMS180431 (formerly BMY21950) Bioorg Med Chem Lett 2:1085-1088 (1992)    Article 
Target
Name:
3-hydroxy-3-methylglutaryl-coenzyme A reductase
Synonyms:
HMDH_RAT Hmgcr
Type:
Enzyme
Mol. Mass.:
96689.85
Organism:
Rattus norvegicus (rat)
Description:
Isolated rat liver microsomes were used as enzyme source.
Residue:
887
  
Inhibitor
Name:
BDBM50014345
Synonyms:
CHEMBL11804 Sodium; 9,9-bis-(4-fluoro-phenyl)-3,5-dihydroxy-8-(1-methyl-1H-tetrazol-5-yl)-nona-6,8-dienoate
Type:
Small organic molecule
Emp. Form.:
C23H21F2N4O4
Mol. Mass.:
455.4346
SMILES:
[#6]-n1nnnc1\[#6](\[#6]=[#6]\[#6@@H](-[#8])-[#6]-[#6@@H](-[#8])-[#6]-[#6](-[#8-])=O)=[#6](\c1ccc(F)cc1)-c1ccc(F)cc1
: