Target
D(2) dopamine receptor
Ligand
BDBM50280824
Substrate
Meas. Tech.
ChEBML_61112
IC50
>100±n/a nM
Citation
 Mignani, SDamour, DDoble, ALabaudinière, RMalleron, JLPiot, OGueremy, C New indole derivatives as potent and selective serotonin uptake inhibitors Bioorg Med Chem Lett 3:1913-1918 (1993)    Article 
Target
Name:
D(2) dopamine receptor
Synonyms:
DOPAMINE D2 Dopamine D2 receptor Drd2
Type:
Enzyme
Mol. Mass.:
50957.64
Organism:
Mus musculus (Mouse)
Description:
P61168
Residue:
444
  
Inhibitor
Name:
BDBM50280824
Synonyms:
1-{2-[4-(5-Fluoro-1H-indol-3-ylmethyl)-piperidin-1-yl]-ethyl}-1,3-dihydro-indol-2-one | CHEMBL300786
Type:
Small organic molecule
Emp. Form.:
C24H26FN3O
Mol. Mass.:
391.4811
SMILES:
Fc1ccc2[nH]cc(CC3CCN(CCN4C(=O)Cc5ccccc45)CC3)c2c1
: