Target
D(2) dopamine receptor
Ligand
BDBM50280821
Substrate
Meas. Tech.
ChEBML_61112
IC50
>100±n/a nM
Citation
 Mignani, SDamour, DDoble, ALabaudinière, RMalleron, JLPiot, OGueremy, C New indole derivatives as potent and selective serotonin uptake inhibitors Bioorg Med Chem Lett 3:1913-1918 (1993)    Article 
Target
Name:
D(2) dopamine receptor
Synonyms:
DOPAMINE D2 Dopamine D2 receptor Drd2
Type:
Enzyme
Mol. Mass.:
50957.64
Organism:
Mus musculus (Mouse)
Description:
P61168
Residue:
444
  
Inhibitor
Name:
BDBM50280821
Synonyms:
2-{2-[4-(5-Fluoro-1H-indol-3-ylmethyl)-piperidin-1-yl]-ethyl}-4,4-dimethyl-3,4-dihydro-2H-benzo[1,2,4]thiazasiline 1,1-dioxide | CHEMBL57514
Type:
Small organic molecule
Emp. Form.:
C25H32FN3O2SSi
Mol. Mass.:
485.689
SMILES:
C[Si]1(C)CN(CCN2CCC(Cc3c[nH]c4ccc(F)cc34)CC2)S(=O)(=O)c2ccccc12
: