Target
3-phosphoshikimate 1-carboxyvinyltransferase
Ligand
BDBM50281348
Substrate
Meas. Tech.
ChEMBL_64961 (CHEMBL676327)
Kd
500±n/a nM
Citation
 Knowles, WSAnderson, KSAndrew, SSPhillion, DPReam, JEJohnson, KASikorski, JA Synthesis & characterization of N-amino-glyphosate as a potent analog inhibitor of E. coli EPSP synthase. Bioorg Med Chem Lett 3:2863-2868 (1993)    Article 
Target
Name:
3-phosphoshikimate 1-carboxyvinyltransferase
Synonyms:
5-enolpyruvylshikimate-3-phosphate synthase aroA
Type:
PROTEIN
Mol. Mass.:
46089.22
Organism:
Escherichia coli (strain K12)
Description:
ChEMBL_65087
Residue:
427
  
Inhibitor
Name:
BDBM50281348
Synonyms:
(N-Phosphonomethyl-hydrazino)-acetic acid | CHEMBL95406
Type:
Small organic molecule
Emp. Form.:
C3H9N2O5P
Mol. Mass.:
184.0877
SMILES:
NN(CC(O)=O)CP(O)(O)=O
: