Target
5-hydroxytryptamine receptor 3A/3B
Ligand
BDBM50282059
Substrate
Meas. Tech.
ChEMBL_3002 (CHEMBL619792)
Ki
>0.000±n/a nM
Comments
>0.000001 20220122
Citation
 Langlois, MSoulier, JLAllainmat, MShen, SGallais, C Derivatives of quinuclidine as 5-HT3 receptor antagonists: influence of an additional carbonyl group on the recognition of chirality by the receptor. Bioorg Med Chem Lett 3:1555-1558 (1993)    Article 
Target
Name:
5-hydroxytryptamine receptor 3A/3B
Synonyms:
Serotonin 3 (5-HT3) receptor | Serotonin 3a (5-HT3a)/3b (5-HT3b) receptor
Type:
Mol. Mass.:
Description:
ASSAY_ID of EBI is 2974
Components:
This complex has 2 components.
Component 1
Name:
5-hydroxytryptamine receptor 3B
Synonyms:
5HT3B_RAT Serotonin (5-HT) receptor
Type:
PROTEIN
Mol. Mass.:
50328.78
Organism:
Rattus norvegicus
Description:
EBI_11885
Residue:
437
  
Component 2
Name:
5-hydroxytryptamine receptor 3A
Synonyms:
5-HT3 5HT3A_RAT Htr3 Serotonin (5-HT) receptor | Zacopride site-R
Type:
Enzyme Catalytic Domain
Mol. Mass.:
55428.70
Organism:
RAT
Description:
5-HT3 HTR3A RAT::P35563
Residue:
483
  
Inhibitor
Name:
BDBM50282059
Synonyms:
CHEMBL433452 | quinuclidine derivative
Type:
Small organic molecule
Emp. Form.:
C18H20N2O
Mol. Mass.:
280.3642
SMILES:
O=C(N[C@H]1CN2CCC1CC2)c1cccc2ccccc12
: