Target
Retinoic acid receptor RXR-alpha
Ligand
BDBM50282694
Substrate
Meas. Tech.
ChEMBL_164856 (CHEMBL769014)
EC50
298±n/a nM
Citation
 Beard, RLGil, DWMarler, DKHenry, EColon, DFGillett, SJArefieg, TBreen, TSKrauss, HDavies, PJChandraratna, RA Structural basis for the differential RXR & RAR activity of stilbene retinoid analogs Bioorg Med Chem Lett 4:1447-1452 (1994)    Article 
Target
Name:
Retinoic acid receptor RXR-alpha
Synonyms:
NR2B1 Nuclear receptor subfamily 4 group A member 2 RXRA Retinoic acid receptor RXR-alpha/gamma Retinoid receptor
Type:
PROTEIN
Mol. Mass.:
50820.38
Organism:
Homo sapiens (Human)
Description:
ChEMBL_1456363
Residue:
462
  
Inhibitor
Name:
BDBM50282694
Synonyms:
4-[(E)-2-(3-Bromo-5,5,8,8-tetramethyl-5,6,7,8-tetrahydro-naphthalen-2-yl)-propenyl]-benzoic acid | CHEMBL284167
Type:
Small organic molecule
Emp. Form.:
C24H27BrO2
Mol. Mass.:
427.374
SMILES:
C\C(=C/c1ccc(cc1)C(O)=O)c1cc2c(cc1Br)C(C)(C)CCC2(C)C
: