Target
5-hydroxytryptamine receptor 1E
Ligand
BDBM50285317
Substrate
Meas. Tech.
ChEMBL_2047 (CHEMBL616844)
IC50
>1000±n/a nM
Citation
 LeBoulluec, KLMattson, RJMahle, CDMcGovern, RTNowak, HPGentile, AJ Bivalent indoles exhibiting serotonergic binding affinity Bioorg Med Chem Lett 5:123-126 (1995)    Article 
Target
Name:
5-hydroxytryptamine receptor 1E
Synonyms:
5-HT-1E 5-Hydroxytryptamine Receptor Subtype 1E (5HT1E) 5-hydroxytryptamine receptor 1E (5-HT-1E) (S31) 5HT1E_HUMAN S31 Serotonin 1e (5-HT1e) receptor | Serotonin Receptor 1E
Type:
G Protein-Coupled Receptor (GPCR)
Mol. Mass.:
41697.80
Organism:
Homo sapiens (Human)
Description:
gi_112822
Residue:
365
  
Inhibitor
Name:
BDBM50285317
Synonyms:
3-(4-{3-[4-(5-carbamoyl-1H-3-indolyl)-3-cyclohexenylamino]propylamino}-1-cyclohexenyl)-1H-5-indolecarboxamide | CHEMBL278610
Type:
Small organic molecule
Emp. Form.:
C33H38N6O2
Mol. Mass.:
550.6938
SMILES:
NC(=O)c1ccc2[nH]cc(C3=CCC(CC3)NCCCNC3CCC(=CC3)c3c[nH]c4ccc(cc34)C(N)=O)c2c1
: