Target
5-hydroxytryptamine receptor 1A
Ligand
BDBM50285319
Substrate
Meas. Tech.
ChEMBL_874 (CHEMBL615929)
IC50
1.27±n/a nM
Citation
 LeBoulluec, KLMattson, RJMahle, CDMcGovern, RTNowak, HPGentile, AJ Bivalent indoles exhibiting serotonergic binding affinity Bioorg Med Chem Lett 5:123-126 (1995)    Article 
Target
Name:
5-hydroxytryptamine receptor 1A
Synonyms:
5-HT-1A 5-HT1A 5-hydroxytryptamine receptor 1A (5HT1A) 5ht1a Htr1a Serotonin 1a (5-HT1a) receptor/Adrenergic receptor alpha-1 | Serotonin receptor 1A
Type:
G Protein-Coupled Receptor (GPCR)
Mol. Mass.:
46445.29
Organism:
Rattus norvegicus (rat)
Description:
Binding assays were performed using rat hippocampal membranes.
Residue:
422
  
Inhibitor
Name:
BDBM50285319
Synonyms:
3-(4-Heptylamino-cyclohex-1-enyl)-1H-indole-5-carboxylic acid amide | CHEMBL417650
Type:
Small organic molecule
Emp. Form.:
C22H31N3O
Mol. Mass.:
353.501
SMILES:
CCCCCCCNC1CCC(=CC1)c1c[nH]c2ccc(cc12)C(N)=O
: