Target
Sterol O-acyltransferase 1
Ligand
BDBM50033969
Substrate
Meas. Tech.
ChEBML_28486
IC50
10±n/a nM
Citation
 Wilde, RJBillheimer, JTGermain, SJGillies, PJHigley, CAKezar, HSMaduskuie, TPShimshick, ESWexler, RR Acyl CoA:cholesterol acyltransferase (ACAT) inhibitors: ureas bearing heterocyclic groups bioisosteric for an imidazole Bioorg Med Chem Lett 5:167-72 (1995)   
Target
Name:
Sterol O-acyltransferase 1
Synonyms:
ACAT-1 Acat SOAT1_RAT Sterol O-acyltransferase, Soat
Type:
PROTEIN
Mol. Mass.:
64165.56
Organism:
Rattus norvegicus
Description:
ChEMBL_28796
Residue:
545
  
Inhibitor
Name:
BDBM50033969
Synonyms:
3-(2,4-Difluoro-phenyl)-1-[5-(4,5-diphenyl-1H-imidazol-2-ylsulfanyl)-pentyl]-1-heptyl-urea Lecimibide
Type:
Small organic molecule
Emp. Form.:
C34H40F2N4OS
Mol. Mass.:
590.769
SMILES:
CCCCCCCN(CCCCCSc1nc(c([nH]1)-c1ccccc1)-c1ccccc1)C(=O)Nc1ccc(F)cc1F
: