Target
Sterol O-acyltransferase 1
Ligand
BDBM50450364
Substrate
Meas. Tech.
ChEBML_28026
IC50
190±n/a nM
Citation
 Wilde, RGBillheimer, JT Acyl CoA:cholesterol acyltransferase (ACAT) inhibitors: ureas bearing two heterocyclic head groups Bioorg Med Chem Lett 5:173-6 (1995)   
Target
Name:
Sterol O-acyltransferase 1
Synonyms:
ACAT-1 Acetoacetyl-CoA thiolase Acyl coenzyme A:cholesterol acyltransferase 1 Cholesterol acyltransferase 1 Soat1 | Sterol O-acyltransferase 1
Type:
PROTEIN
Mol. Mass.:
63818.83
Organism:
Mus musculus
Description:
ChEMBL_90523
Residue:
540
  
Inhibitor
Name:
BDBM50450364
Synonyms:
CHEMBL50171
Type:
Small organic molecule
Emp. Form.:
C35H35F2N5O3S
Mol. Mass.:
643.746
SMILES:
COc1ccc(cc1)-c1nc(SCCCCCN(Cc2ccccn2)C(=O)Nc2ccc(F)cc2F)[nH]c1-c1ccc(OC)cc1
: