Target
Sterol O-acyltransferase 1
Ligand
BDBM50285447
Substrate
Meas. Tech.
ChEBML_28031
IC50
70±n/a nM
Citation
 Wilde, RGKlaczkiewicz, JDBillheimer, JTWexler, RRGillies, PJ Acyl CoA:cholesterol acyltransferase (ACAT) inhibitors: heterocyclic bioisosteres for the urea group in DuP 128 Bioorg Med Chem Lett 5:177-180 (1995)    Article 
Target
Name:
Sterol O-acyltransferase 1
Synonyms:
ACAT-1 Acetoacetyl-CoA thiolase Acyl coenzyme A:cholesterol acyltransferase 1 Cholesterol acyltransferase 1 Soat1 | Sterol O-acyltransferase 1
Type:
PROTEIN
Mol. Mass.:
63818.83
Organism:
Mus musculus
Description:
ChEMBL_90523
Residue:
540
  
Inhibitor
Name:
BDBM50285447
Synonyms:
CHEMBL53397 | {5-[4,5-Bis-(4-methoxy-phenyl)-1H-imidazol-2-ylsulfanyl]-pentyl}-butyl-(5-tert-butyl-benzooxazol-2-yl)-amine
Type:
Small organic molecule
Emp. Form.:
C37H46N4O3S
Mol. Mass.:
626.851
SMILES:
CCCCN(CCCCCSc1nc(c([nH]1)-c1ccc(OC)cc1)-c1ccc(OC)cc1)c1nc2cc(ccc2o1)C(C)(C)C
: