Target
1,3-beta-glucan synthase
Ligand
BDBM50285488
Substrate
Meas. Tech.
ChEBML_37687
IC50
5±n/a nM
Citation
 Zambias, RAJames, CHammond, MLAbruzzo, GKBartizal, KFNollstadt, KHDouglas, CMarrinan, JBalkovec, JM Antifungal lipopeptides: Structure-activity relationships of 3-hydroxyglutamine-modified pneumocandin B0 derivatives Bioorg Med Chem Lett 5:2357-2362 (1995)    Article 
Target
Name:
1,3-beta-glucan synthase
Synonyms:
1,3-beta-glucan synthase Glucan Synthase
Type:
Enzyme
Mol. Mass.:
218006.59
Organism:
Candida albicans (Yeast)
Description:
O13428
Residue:
1897
  
Inhibitor
Name:
BDBM50285488
Synonyms:
1N-[23-[1,2-dihydroxy-2-(4-hydroxyphenyl)ethyl]-20-(3-dimethylamino-1-hydroxypropyl)-2,11,12,15-tetrahydroxy-6-(1-hydroxyethyl)-5,8,14,19,22,25-hexaoxoperhydrodipyrrolo[2,1-c:2,1-l][1,4,7,10,13,16]hexaazacyclohenicosin-9-yl]-10,12-dimethyltetrade | CHEMBL428110
Type:
Small organic molecule
Emp. Form.:
C52H86N8O16
Mol. Mass.:
1079.2832
SMILES:
CCC(C)CC(C)CCCCCCCCC(=O)N[C@H]1C[C@@H](O)[C@@H](O)NC(=O)[C@@H]2[C@@H](O)CCN2C(=O)[C@@H](NC(=O)[C@@H](NC(=O)[C@@H]2C[C@@H](O)CN2C(=O)[C@@H](NC1=O)[C@@H](C)O)[C@H](O)[C@@H](O)c1ccc(O)cc1)[C@H](O)CCN(C)C
: