Target
1,3-beta-glucan synthase
Ligand
BDBM50285491
Substrate
Meas. Tech.
ChEBML_37687
IC50
7±n/a nM
Citation
 Zambias, RAJames, CHammond, MLAbruzzo, GKBartizal, KFNollstadt, KHDouglas, CMarrinan, JBalkovec, JM Antifungal lipopeptides: Structure-activity relationships of 3-hydroxyglutamine-modified pneumocandin B0 derivatives Bioorg Med Chem Lett 5:2357-2362 (1995)    Article 
Target
Name:
1,3-beta-glucan synthase
Synonyms:
1,3-beta-glucan synthase Glucan Synthase
Type:
Enzyme
Mol. Mass.:
218006.59
Organism:
Candida albicans (Yeast)
Description:
O13428
Residue:
1897
  
Inhibitor
Name:
BDBM50285491
Synonyms:
10,12-Dimethyl-tetradecanoic acid [6-[1,2-dihydroxy-2-(4-hydroxy-phenyl)-ethyl]-3-(3-guanidino-1-hydroxy-propyl)-11,20,21,25-tetrahydroxy-15-(1-hydroxy-ethyl)-2,5,8,14,17,23-hexaoxo-1,4,7,13,16,22-hexaaza-tricyclo[22.3.0.0*9,13*]heptacos-18-yl]-amide | CHEMBL385931
Type:
Small organic molecule
Emp. Form.:
C51H84N10O16
Mol. Mass.:
1093.2701
SMILES:
CCC(C)CC(C)CCCCCCCCC(=O)N[C@H]1C[C@@H](O)[C@@H](O)NC(=O)[C@@H]2[C@@H](O)CCN2C(=O)[C@@H](NC(=O)[C@@H](NC(=O)[C@@H]2C[C@@H](O)CN2C(=O)[C@@H](NC1=O)[C@@H](C)O)[C@H](O)[C@@H](O)c1ccc(O)cc1)[C@H](O)CCNC(N)=N
: