Target
Proto-oncogene tyrosine-protein kinase Src
Ligand
BDBM50175493
Substrate
Meas. Tech.
ChEBML_216849
IC50
15700±n/a nM
Citation
 Zimmermann, JBuchdunger, EMett, HMeyer, TLydon, NBTraxler, P Phenylamino-pyrimidine (PAP) — derivatives: a new class of potent and highly selective PDGF-receptor autophosphorylation inhibitors Bioorg Med Chem Lett 6:1221-1226 (1996)    Article 
Target
Name:
Proto-oncogene tyrosine-protein kinase Src
Synonyms:
Calmodulin/Proto-oncogene tyrosine-protein kinase Src Proto-oncogene c-Src SRC SRC_HUMAN V-src sarcoma (Schmidt-Ruppin A-2) viral oncogene homolog (avian) p60-Src | pp60c-src
Type:
Protein
Mol. Mass.:
59838.60
Organism:
Homo sapiens (Human)
Description:
P12931
Residue:
536
  
Inhibitor
Name:
BDBM50175493
Synonyms:
CHEMBL277931 | N-[3-(4-Pyridin-3-yl-pyrimidin-2-ylamino)-phenyl]-benzamide
Type:
Small organic molecule
Emp. Form.:
C22H17N5O
Mol. Mass.:
367.4033
SMILES:
O=C(Nc1cccc(Nc2nccc(n2)-c2cccnc2)c1)c1ccccc1
: