Target
Adenosylhomocysteinase
Ligand
BDBM50029130
Substrate
Meas. Tech.
ChEMBL_196712 (CHEMBL803315)
Ki
3.3±n/a nM
Citation
 Neenan, JPOpitz, SMCooke, CLUssery, MAMorrill, TCEckel, LM Adenosine dialdehyde analogs I: Regioselective synthesis of adenosine monoaldehydes Bioorg Med Chem Lett 6:1381-1386 (1996)    Article 
Target
Name:
Adenosylhomocysteinase
Synonyms:
AHCY SAHH | SAHH_HUMAN
Type:
PROTEIN
Mol. Mass.:
47714.06
Organism:
Homo sapiens (Human)
Description:
ChEMBL_1507791
Residue:
432
  
Inhibitor
Name:
BDBM50029130
Synonyms:
Adenosine dialdehyde | CHEMBL165876
Type:
Small organic molecule
Emp. Form.:
C10H11N5O4
Mol. Mass.:
265.2254
SMILES:
Nc1ncnc2n(cnc12)[C@H](O[C@H](CO)C=O)C=O
: