Target
Arachidonate 5-lipoxygenase-activating protein/Polyunsaturated fatty acid 5-lipoxygenase
Ligand
BDBM50080255
Substrate
Meas. Tech.
ChEMBL_89925 (CHEMBL873225)
IC50
360±n/a nM
Citation
 Woods, KWBrooks, CDMaki, RGRodriques, KEBouska, JBYoung, PBell, RLCarter, GW O-alkylcarboxylate oxime and N-hydroxyurea analogs of substituted indole leukotriene biosynthesis inhibitors Bioorg Med Chem Lett 6:1547-1552 (1996)    Article 
Target
Name:
Arachidonate 5-lipoxygenase-activating protein/Polyunsaturated fatty acid 5-lipoxygenase
Synonyms:
5-Lipoxygenase/5-lipoxygenase activating protein
Type:
Mol. Mass.:
Description:
ASSAY_ID of EBI is 88346
Components:
This complex has 2 components.
Component 1
Name:
Polyunsaturated fatty acid 5-lipoxygenase
Synonyms:
5-LO 5-Lipoxygenase (5-LO) 5-Lipoygenase ALOX5 LOG5 | LOX5_HUMAN
Type:
Enzyme
Mol. Mass.:
77972.74
Organism:
Homo sapiens (Human)
Description:
Recombinant protein was purified from E. coli lysate. After ammonium sulfate precipitation and subsequent steps, the supernatant (S100) was used for 5-LO activity assay.
Residue:
674
  
Component 2
Name:
Arachidonate 5-lipoxygenase-activating protein
Synonyms:
5-lipoxygenase activating protein 5-lipoxygenase/FLAP ALOX5AP MK-886-binding protein
Type:
Enzyme
Mol. Mass.:
18159.90
Organism:
Homo sapiens (Human)
Description:
P20292
Residue:
161
  
Inhibitor
Name:
BDBM50080255
Synonyms:
3-[5-(Benzothiazol-2-ylmethoxy)-3-tert-butylsulfanyl-1-(4-chloro-benzyl)-1H-indol-2-yl]-2,2-dimethyl-propionic acid | CHEMBL38545
Type:
Small organic molecule
Emp. Form.:
C32H33ClN2O3S2
Mol. Mass.:
593.199
SMILES:
CC(C)(C)Sc1c(CC(C)(C)C(O)=O)n(Cc2ccc(Cl)cc2)c2ccc(OCc3nc4ccccc4s3)cc12
: