Target
5-hydroxytryptamine receptor 1A
Ligand
BDBM50026926
Substrate
Meas. Tech.
ChEMBL_841 (CHEMBL615840)
IC50
2±n/a nM
Citation
 López-Rodríguez, MLMorcillo, MRosado, MBenhamu, BSanz, AM 2-[4-(o-methoxyphenyl)piperazin-1-ylmethyl]-1,3-dioxoperhydroimidazo[1,5-a]pyridine as a new selective 5-HT1A receptor ligand Bioorg Med Chem Lett 6:689-694 (1996)    Article 
Target
Name:
5-hydroxytryptamine receptor 1A
Synonyms:
5-HT-1A 5-HT1A 5-hydroxytryptamine receptor 1A (5HT1A) 5ht1a Htr1a Serotonin 1a (5-HT1a) receptor/Adrenergic receptor alpha-1 | Serotonin receptor 1A
Type:
G Protein-Coupled Receptor (GPCR)
Mol. Mass.:
46445.29
Organism:
Rattus norvegicus (rat)
Description:
Binding assays were performed using rat hippocampal membranes.
Residue:
422
  
Inhibitor
Name:
BDBM50026926
Synonyms:
8-{4-[4-(2-Methoxy-phenyl)-piperazin-1-yl]-butyl}-8-aza-spiro[4.5]decane-7,9-dione | CHEMBL27429
Type:
Small organic molecule
Emp. Form.:
C24H35N3O3
Mol. Mass.:
413.553
SMILES:
COc1ccccc1N1CCN(CCCCN2C(=O)CC3(CCCC3)CC2=O)CC1
: