Target
Sodium-dependent serotonin transporter
Ligand
BDBM84742
Substrate
Ki
2135±n/a nM
Comments
PDSP_5207
Citation
 Cheetham, SCViggers, JASlater, NAHeal, DJBuckett, WR [3H]paroxetine binding in rat frontal cortex strongly correlates with [3H]5-HT uptake: effect of administration of various antidepressant treatments. Neuropharmacology 32:737-43 (1993)  
Target
Name:
Sodium-dependent serotonin transporter
Synonyms:
5-HT Transporter 5HT transporter Anandamid membrane transporter, AMT Monoamine transporters; Norepinephrine & serotonin Slc6a4 Sodium-dependent serotonin transporter (SERT) | imipramine receptor
Type:
Multi-pass membrane protein
Mol. Mass.:
70168.43
Organism:
Rattus norvegicus (rat)
Description:
P31652
Residue:
630
  
Inhibitor
Name:
BDBM84742
Synonyms:
CAS_106650-56-0 sibutramine
Type:
Small organic molecule
Emp. Form.:
C17H26ClN
Mol. Mass.:
279.848
SMILES:
CC(C)CC(N(C)C)C1(CCC1)c1ccc(Cl)cc1
: