Target
Protein kinase C alpha type
Ligand
BDBM50175491
Substrate
Meas. Tech.
ChEBML_160264
IC50
>100000±n/a nM
Citation
 Zimmermann, JBuchdunger, EMett, HMeyer, TLydon, NB Potent and selective inhibitors of the Abl-kinase: phenylamino-pyrimidine (PAP) derivatives Bioorg Med Chem Lett 7:187-192 (1997)    Article 
Target
Name:
Protein kinase C alpha type
Synonyms:
KPCA_HUMAN PKC alpha and beta-2 PKC-alpha PRKACA Protein Kinase C- alpha Protein kinase C alpha (PKCa) Protein kinase C alpha type (PRKCA) RAF proto-oncogene serine/threonine-protein kinase
Type:
Enzyme
Mol. Mass.:
76755.65
Organism:
Homo sapiens (Human)
Description:
The recombinant human PKC enzymes were produced using a baculovirus expression system in SF9 cells
Residue:
672
  
Inhibitor
Name:
BDBM50175491
Synonyms:
4-Methyl-N-[4-methyl-3-(4-pyridin-3-yl-pyrimidin-2-ylamino)-phenyl]-benzamide | CHEMBL20867
Type:
Small organic molecule
Emp. Form.:
C24H21N5O
Mol. Mass.:
395.4564
SMILES:
Cc1ccc(cc1)C(=O)Nc1ccc(C)c(Nc2nccc(n2)-c2cccnc2)c1
: