Target
Protein kinase C delta type
Ligand
BDBM50175493
Substrate
Meas. Tech.
ChEBML_160778
IC50
23000±n/a nM
Citation
 Zimmermann, JBuchdunger, EMett, HMeyer, TLydon, NB Potent and selective inhibitors of the Abl-kinase: phenylamino-pyrimidine (PAP) derivatives Bioorg Med Chem Lett 7:187-192 (1997)    Article 
Target
Name:
Protein kinase C delta type
Synonyms:
KPCD_HUMAN PKCD Protein Kinase C- delta nPKC-delta
Type:
Enzyme
Mol. Mass.:
77516.79
Organism:
Homo sapiens (Human)
Description:
The recombinant human PKC enzymes were produced using a baculovirus expression system in SF9 cells
Residue:
676
  
Inhibitor
Name:
BDBM50175493
Synonyms:
CHEMBL277931 | N-[3-(4-Pyridin-3-yl-pyrimidin-2-ylamino)-phenyl]-benzamide
Type:
Small organic molecule
Emp. Form.:
C22H17N5O
Mol. Mass.:
367.4033
SMILES:
O=C(Nc1cccc(Nc2nccc(n2)-c2cccnc2)c1)c1ccccc1
: